Reaction Details
TargetChondroitin sulfate N-acetylgalactosaminyltransferase 1
LigandBDBM50386141
Substrate/Competitorn/a
Meas. Tech.ChEMBL_824644 (CHEMBL2045702)
IC50 141000±n/a nM
Citation Jadhav, RDKadam, KSKandre, SGuha, TReddy, MMBrahma, MKDeshmukh, NJDixit, ADoshi, LPotdar, NEnose, AAVishwakarma, RASivaramakrishnan, HSrinivasan, SNemmani, KVGupte, AGangopadhyay, AKSharma, R Synthesis and biological evaluation of isoxazole, oxazole, and oxadiazole containing heteroaryl analogs of biaryl ureas as DGAT1 inhibitors. Eur J Med Chem54:324-42 (2012) 
 
Chondroitin sulfate N-acetylgalactosaminyltransferase 1
Name:Chondroitin sulfate N-acetylgalactosaminyltransferase 1
Type:PROTEIN
Mol. Mass.:61307.78
Organism:Homo sapiens (Human)
Description:ChEMBL_824644
Residue:532
BDBM50386141
NameBDBM50386141
Synonyms:CHEMBL2042343
TypeSmall organic molecule
Emp. Form.C22H20F2N4O5
Mol. Mass.458.4148
SMILESCC(C)[C@H](NC(=O)c1cc(no1)-c1ccc(NC(=O)Nc2cc(F)ccc2F)cc1)C(O)=O