Reaction Details
TargetKinesin-like protein KIF11
LigandBDBM23802
Substrate/Competitorn/a
Meas. Tech.ChEMBL_824371 (CHEMBL2044661)
IC50 241.2±n/a nM
Citation Abualhasan, MNGood, JAWittayanarakul, KAnthony, NGBerretta, GRath, OKozielski, FSutcliffe, OBMackay, SP Doing the methylene shuffle--further insights into the inhibition of mitotic kinesin Eg5 with S-trityl L-cysteine. Eur J Med Chem54:483-98 (2012) 
 
Kinesin-like protein KIF11
Name:Kinesin-like protein KIF11
Type:PROTEIN
Mol. Mass.:119138.97
Organism:Homo sapiens (Human)
Description:ChEMBL_1457426
Residue:1056
BDBM23802
NameBDBM23802
Synonyms:2-[(triphenylmethyl)sulfanyl]ethan-1-amine | Triphenylmethyl-containing compound, 31
TypeSmall organic molecule
Emp. Form.C21H21NS
Mol. Mass.319.463
SMILESNCCSC(c1ccccc1)(c1ccccc1)c1ccccc1