Reaction Details
TargetPotassium voltage-gated channel subfamily H member 2
LigandBDBM50386291
Substrate/Competitorn/a
Meas. Tech.ChEMBL_826565 (CHEMBL2050733)
IC50>30000±n/a nM
Citation Amato, GRoeloffs, RRigdon, GCAntonio, BMersch, TMcNaughton-Smith, GWickenden, ADFritch, PSuto, MJ N-Pyridyl and Pyrimidine Benzamides as KCNQ2/Q3 Potassium Channel Openers for the Treatment of Epilepsy. ACS Med Chem Lett2:481-484 (2011) 
 
Potassium voltage-gated channel subfamily H member 2
Name:Potassium voltage-gated channel subfamily H member 2
Type:Multi-pass membrane protein
Mol. Mass.:126672.65
Organism:Homo sapiens (Human)
Description:Q12809
Residue:1159
BDBM50386291
NameBDBM50386291
Synonyms:CHEMBL2047521
TypeSmall organic molecule
Emp. Form.C11H6ClF2N3O
Mol. Mass.269.635
SMILESFc1ccc(cc1F)C(=O)Nc1cnc(Cl)nc1