Reaction Details
TargetSodium channel protein type 5 subunit alpha
LigandBDBM50386291
Substrate/Competitorn/a
Meas. Tech.ChEMBL_826566 (CHEMBL2050734)
IC50>30000±n/a nM
Citation Amato, GRoeloffs, RRigdon, GCAntonio, BMersch, TMcNaughton-Smith, GWickenden, ADFritch, PSuto, MJ N-Pyridyl and Pyrimidine Benzamides as KCNQ2/Q3 Potassium Channel Openers for the Treatment of Epilepsy. ACS Med Chem Lett2:481-484 (2011) 
 
Sodium channel protein type 5 subunit alpha
Name:Sodium channel protein type 5 subunit alpha
Type:Enzyme
Mol. Mass.:226908.60
Organism:Homo sapiens (Human)
Description:Q14524
Residue:2016
BDBM50386291
NameBDBM50386291
Synonyms:CHEMBL2047521
TypeSmall organic molecule
Emp. Form.C11H6ClF2N3O
Mol. Mass.269.635
SMILESFc1ccc(cc1F)C(=O)Nc1cnc(Cl)nc1