Reaction Details
TargetKynurenine/alpha-aminoadipate aminotransferase, mitochondrial
LigandBDBM50386299
Substrate/Competitorn/a
Meas. Tech.ChEMBL_826599 (CHEMBL2050767)
IC50 1170±n/a nM
Citation Dounay, ABAnderson, MBechle, BMCampbell, BMClaffey, MMEvdokimov, AEvrard, EFonseca, KRGan, XGhosh, SHayward, MMHorner, WKim, JYMcAllister, LAPandit, JParadis, VParikh, VDReese, MRRong, SSalafia, MASchuyten, KStrick, CATuttle, JBValentine, JWang, HZawadzke, LEVerhoest, PR Discovery of Brain-Penetrant, Irreversible Kynurenine Aminotransferase II Inhibitors for Schizophrenia. ACS Med Chem Lett3:187-192 (2012) 
 
Kynurenine/alpha-aminoadipate aminotransferase, mitochondrial
Name:Kynurenine/alpha-aminoadipate aminotransferase, mitochondrial
Type:PROTEIN
Mol. Mass.:47788.12
Organism:Rattus norvegicus
Description:ChEMBL_826599
Residue:425
BDBM50386299
NameBDBM50386299
Synonyms:CHEMBL2047852
TypeSmall organic molecule
Emp. Form.C9H10N2O2
Mol. Mass.178.1879
SMILESN[C@@H]1Cc2ccccc2N(O)C1=O