Reaction Details
TargetKynurenine/alpha-aminoadipate aminotransferase, mitochondrial
LigandBDBM50386309
Substrate/Competitorn/a
Meas. Tech.ChEMBL_826598 (CHEMBL2050766)
IC50 37±n/a nM
Citation Dounay, ABAnderson, MBechle, BMCampbell, BMClaffey, MMEvdokimov, AEvrard, EFonseca, KRGan, XGhosh, SHayward, MMHorner, WKim, JYMcAllister, LAPandit, JParadis, VParikh, VDReese, MRRong, SSalafia, MASchuyten, KStrick, CATuttle, JBValentine, JWang, HZawadzke, LEVerhoest, PR Discovery of Brain-Penetrant, Irreversible Kynurenine Aminotransferase II Inhibitors for Schizophrenia. ACS Med Chem Lett3:187-192 (2012) 
 
Kynurenine/alpha-aminoadipate aminotransferase, mitochondrial
Name:Kynurenine/alpha-aminoadipate aminotransferase, mitochondrial
Type:Enzyme
Mol. Mass.:47353.09
Organism:Homo sapiens (Human)
Description:Q8N5Z0
Residue:425
BDBM50386309
NameBDBM50386309
Synonyms:CHEMBL2047862
TypeSmall organic molecule
Emp. Form.C10H12N2O2
Mol. Mass.192.2145
SMILESCc1ccc2C[C@H](N)C(=O)N(O)c2c1