Reaction Details
TargetIntegrin alpha-L/Integrin beta-2/Intercellular adhesion molecule 1
LigandBDBM50386331
Substrate/Competitorn/a
Meas. Tech.ChEMBL_826669 (CHEMBL2051013)
IC50 74±n/a nM
Citation Zhong, MGadek, TRBui, MShen, WBurnier, JBarr, KJHanan, EJOslob, JDYu, CHZhu, JArkin, MREvanchik, MJFlanagan, WMHoch, UHyde, JPrabhu, SSilverman, JAWright, J Discovery and Development of Potent LFA-1/ICAM-1 Antagonist SAR 1118 as an Ophthalmic Solution for Treating Dry Eye. ACS Med Chem Lett3:203-206 (2012) 
 
Integrin alpha-L/Integrin beta-2/Intercellular adhesion molecule 1
Name:Integrin alpha-L/Integrin beta-2/Intercellular adhesion molecule 1
Type:n/a
Mol. Mass.:n/a
Description:ASSAY_ID of EBI is 97281
Components:This complex has 3 components.
Component 1
Name:Integrin alpha-L
Synonyms:CD11 antigen-like family member A CD_antigen=CD11a ITGAL LFA-1A Leukocyte adhesion glycoprotein LFA-1 alpha chain | Leukocyte function-associated molecule 1 alpha chain
Type:PROTEIN
Mol. Mass.:128748.90
Organism:Homo sapiens (Human)
Description:ChEMBL_629045
Residue:1170
Component 2
Name:Intercellular adhesion molecule 1
Synonyms:CD_antigen=CD54 ICAM1 Intercellular adhesion molecule (ICAM-1), Integrin alpha-L/beta-2 Intercellular adhesion molecule-1 | Major group rhinovirus receptor
Type:PROTEIN
Mol. Mass.:57831.10
Organism:Homo sapiens (Human)
Description:ChEMBL_826675
Residue:532
Component 3
Name:Integrin beta-2
Synonyms:CD18 ITGB2 MFI7
Type:PROTEIN
Mol. Mass.:84785.60
Organism:Homo sapiens (Human)
Description:EBI_12662
Residue:769
BDBM50386331
NameBDBM50386331
Synonyms:CHEMBL2048028
TypeSmall organic molecule
Emp. Form.C29H24Cl2N2O7S
Mol. Mass.615.481
SMILESCS(=O)(=O)c1cccc(C[C@H](NC(=O)c2c(Cl)cc3CN(CCc3c2Cl)C(=O)c2ccc3ccoc3c2)C(O)=O)c1