Reaction Details
TargetHistamine H3 receptor
LigandBDBM50386351
Substrate/Competitorn/a
Meas. Tech.ChEMBL_826695 (CHEMBL2051142)
Ki 3±n/a nM
Citation Rao, AUShao, NAslanian, RGChan, TYDegrado, SJWang, LMcKittrick, BSenior, MWest, REWilliams, SMWu, RLHwa, JPatel, BZheng, SSondey, CPalani, A Discovery of a potent thiadiazole class of histamine h3 receptor antagonist for the treatment of diabetes. ACS Med Chem Lett3:198-202 (2012) 
 
Histamine H3 receptor
Name:Histamine H3 receptor
Type:G Protein-Coupled Receptor (GPCR)
Mol. Mass.:48691.47
Organism:Homo sapiens (Human)
Description:Binding assays were using CHO cells stably expressing hH3R receptors.
Residue:445
BDBM50386351
NameBDBM50386351
Synonyms:CHEMBL2048589
TypeSmall organic molecule
Emp. Form.C22H30N6S
Mol. Mass.410.579
SMILESC1CCN(CC1)C1CCN(CC1)c1nnc(s1)N1CCCC(=C1)c1ccccn1