Reaction Details
TargetMu-type opioid receptor
LigandBDBM50386386
Substrate/Competitorn/a
Meas. Tech.ChEMBL_826807 (CHEMBL2051428)
Ki 0.43±n/a nM
Citation Renton, PGreen, BMaddaford, SRakhit, SAndrews, JS NOpiates: Novel Dual Action Neuronal Nitric Oxide Synthase Inhibitors with µ-Opioid Agonist Activity. ACS Med Chem Lett3:227-231 (2012) 
 
Mu-type opioid receptor
Name:Mu-type opioid receptor
Type:G Protein-Coupled Receptor (GPCR)
Mol. Mass.:44789.51
Organism:Homo sapiens (Human)
Description:P35372
Residue:400
BDBM50386386
NameBDBM50386386
Synonyms:CHEMBL2046871
TypeSmall organic molecule
Emp. Form.C23H28N4O3
Mol. Mass.408.4934
SMILESCCOc1ccc(Cc2nc3cc(ccc3n2CCC2CCCN2C)[N+]([O-])=O)cc1