Reaction Details
TargetMembrane-bound lytic murein transglycosylase B
LigandBDBM50386413
Substrate/Competitorn/a
Meas. Tech.ChEMBL_826832 (CHEMBL2051549)
Kd 1000000±n/a nM
Citation Yamaguchi, TBlázquez, BHesek, DLee, MLlarrull, LIBoggess, BOliver, AGFisher, JFMobashery, S Inhibitors for Bacterial Cell-Wall Recycling. ACS Med Chem Lett3:238-242 (2012) 
 
Membrane-bound lytic murein transglycosylase B
Name:Membrane-bound lytic murein transglycosylase B
Type:PROTEIN
Mol. Mass.:40263.83
Organism:Escherichia coli (strain K12)
Description:ChEMBL_826832
Residue:361
BDBM50386413
NameBDBM50386413
Synonyms:CHEMBL2047303
TypeSmall organic molecule
Emp. Form.C11H20N2O6
Mol. Mass.276.2863
SMILESC[C@@H](O[C@@H]1[C@H](CN[C@H](CO)[C@H]1O)NC(C)=O)C(O)=O