Reaction Details
TargetKallikrein-6
LigandBDBM50080493
Substrate/Competitorn/a
Meas. Tech.ChEMBL_826901 (CHEMBL2051716)
IC50 7750±n/a nM
Citation Liang, GChen, XAldous, SPu, SFMehdi, SPowers, EGiovanni, AKongsamut, SXia, TZhang, YWang, RGao, ZMerriman, GMcLean, LRMorize, I Virtual Screening and X-ray Crystallography for Human Kallikrein 6 Inhibitors with an Amidinothiophene P1 Group. ACS Med Chem Lett3:159-164 (2012) 
 
Kallikrein-6
Name:Kallikrein-6
Type:PROTEIN
Mol. Mass.:26861.50
Organism:Homo sapiens (Human)
Description:ChEMBL_826901
Residue:244
BDBM50080493
NameBDBM50080493
Synonyms:5-[(S)-3-(7-Methoxy-naphthalene-2-sulfonylamino)-2-oxo-pyrrolidin-1-ylmethyl]-thiophene-2-carboxamidine | CHEMBL435585
TypeSmall organic molecule
Emp. Form.C21H22N4O4S2
Mol. Mass.458.554
SMILESCOc1ccc2ccc(cc2c1)S(=O)(=O)N[C@H]1CCN(Cc2ccc(s2)C(N)=N)C1=O