Reaction Details
TargetHistone deacetylase 6
LigandBDBM50386441
Substrate/Competitorn/a
Meas. Tech.ChEMBL_827135 (CHEMBL2050419)
IC50 640±n/a nM
Citation Baud, MGLeiser, THaus, PSamlal, SWong, ACWood, RJPetrucci, VGunaratnam, MHughes, SMBuluwela, LTurlais, FNeidle, SMeyer-Almes, FJWhite, AJFuchter, MJ Defining the mechanism of action and enzymatic selectivity of psammaplin A against its epigenetic targets. J Med Chem55:1731-50 (2012) 
 
Histone deacetylase 6
Name:Histone deacetylase 6
Type:Chromatin regulator; hydrolase; repressor
Mol. Mass.:131381.51
Organism:Homo sapiens (Human)
Description:Q9UBN7
Residue:1215
BDBM50386441
NameBDBM50386441
Synonyms:CHEMBL2047692
TypeSmall organic molecule
Emp. Form.C11H12BrFN2O2S
Mol. Mass.335.193
SMILESFc1ccc(CC(N=O)C(=O)NCCS)cc1Br