Reaction Details
TargetHistone deacetylase-like amidohydrolase
LigandBDBM50386451
Substrate/Competitorn/a
Meas. Tech.ChEMBL_827139 (CHEMBL2050423)
IC50 310±n/a nM
Citation Baud, MGLeiser, THaus, PSamlal, SWong, ACWood, RJPetrucci, VGunaratnam, MHughes, SMBuluwela, LTurlais, FNeidle, SMeyer-Almes, FJWhite, AJFuchter, MJ Defining the mechanism of action and enzymatic selectivity of psammaplin A against its epigenetic targets. J Med Chem55:1731-50 (2012) 
 
Histone deacetylase-like amidohydrolase
Name:Histone deacetylase-like amidohydrolase
Type:PROTEIN
Mol. Mass.:39419.78
Organism:Alcaligenes sp. (strain DSM 11172) (Bordetella sp. (strain FB188))
Description:ChEMBL_827139
Residue:369
BDBM50386451
NameBDBM50386451
Synonyms:CHEMBL2047685
TypeSmall organic molecule
Emp. Form.C13H16BrN3O5
Mol. Mass.374.187
SMILESONC(=O)CCCNC(=O)C(Cc1ccc(O)c(Br)c1)N=O