Reaction Details
TargetHistone deacetylase 1
LigandBDBM50386456
Substrate/Competitorn/a
Meas. Tech.ChEMBL_827136 (CHEMBL2050420)
IC50 43±n/a nM
Citation Baud, MGLeiser, THaus, PSamlal, SWong, ACWood, RJPetrucci, VGunaratnam, MHughes, SMBuluwela, LTurlais, FNeidle, SMeyer-Almes, FJWhite, AJFuchter, MJ Defining the mechanism of action and enzymatic selectivity of psammaplin A against its epigenetic targets. J Med Chem55:1731-50 (2012) 
 
Histone deacetylase 1
Name:Histone deacetylase 1
Type:Enzyme
Mol. Mass.:55090.27
Organism:Homo sapiens (Human)
Description:Q13547
Residue:482
BDBM50386456
NameBDBM50386456
Synonyms:CHEMBL2047539
TypeSmall organic molecule
Emp. Form.C24H28Br2N4O6S2
Mol. Mass.692.44
SMILESCOc1ccc(CC(N=O)C(=O)NCCSSCCNC(=O)C(Cc2ccc(OC)c(Br)c2)N=O)cc1Br