Reaction Details
TargetHistone deacetylase 1
LigandBDBM50386461
Substrate/Competitorn/a
Meas. Tech.ChEMBL_827136 (CHEMBL2050420)
IC50 220±n/a nM
Citation Baud, MGLeiser, THaus, PSamlal, SWong, ACWood, RJPetrucci, VGunaratnam, MHughes, SMBuluwela, LTurlais, FNeidle, SMeyer-Almes, FJWhite, AJFuchter, MJ Defining the mechanism of action and enzymatic selectivity of psammaplin A against its epigenetic targets. J Med Chem55:1731-50 (2012) 
 
Histone deacetylase 1
Name:Histone deacetylase 1
Type:Enzyme
Mol. Mass.:55090.27
Organism:Homo sapiens (Human)
Description:Q13547
Residue:482
BDBM50386461
NameBDBM50386461
Synonyms:CHEMBL2047668
TypeSmall organic molecule
Emp. Form.C26H32Br2N4O6S2
Mol. Mass.720.493
SMILESCO\N=C(/Cc1ccc(OC)c(Br)c1)C(=O)NCCSSCCNC(=O)C(\Cc1ccc(OC)c(Br)c1)=N\OC