Reaction Details
TargetHistone deacetylase 6
LigandBDBM50117090
Substrate/Competitorn/a
Meas. Tech.ChEMBL_827135 (CHEMBL2050419)
IC50 2800±n/a nM
Citation Baud, MGLeiser, THaus, PSamlal, SWong, ACWood, RJPetrucci, VGunaratnam, MHughes, SMBuluwela, LTurlais, FNeidle, SMeyer-Almes, FJWhite, AJFuchter, MJ Defining the mechanism of action and enzymatic selectivity of psammaplin A against its epigenetic targets. J Med Chem55:1731-50 (2012) 
 
Histone deacetylase 6
Name:Histone deacetylase 6
Type:Chromatin regulator; hydrolase; repressor
Mol. Mass.:131381.51
Organism:Homo sapiens (Human)
Description:Q9UBN7
Residue:1215
BDBM50117090
NameBDBM50117090
Synonyms:(E,E)-Psammaplin A 3-(3-Bromo-4-hydroxy-phenyl)-N-(2-{2-[3-(3-bromo-4-hydroxy-phenyl)-2-hydroxyimino-propionylamino]-ethyldisulfanyl}-ethyl)-2-hydroxyimino-propionamide 3-(3-bromo-4-hydroxy-phenyl)-N-[2-(2-{3-(3-bromo-4-hydroxy-phenyl)-2-[hydroxyimino]-propionylamino}-ethyldisulfanyl)-ethyl]-2-[hydroxyimino]-propionamide Psammaplin A
TypeSmall organic molecule
Emp. Form.C22H24Br2N4O6S2
Mol. Mass.664.387
SMILESOc1ccc(CC(N=O)C(=O)NCCSSCCNC(=O)C(Cc2ccc(O)c(Br)c2)N=O)cc1Br