Reaction Details
TargetHistone deacetylase 6
LigandBDBM50386453
Substrate/Competitorn/a
Meas. Tech.ChEMBL_827135 (CHEMBL2050419)
IC50 360±n/a nM
Citation Baud, MGLeiser, THaus, PSamlal, SWong, ACWood, RJPetrucci, VGunaratnam, MHughes, SMBuluwela, LTurlais, FNeidle, SMeyer-Almes, FJWhite, AJFuchter, MJ Defining the mechanism of action and enzymatic selectivity of psammaplin A against its epigenetic targets. J Med Chem55:1731-50 (2012) 
 
Histone deacetylase 6
Name:Histone deacetylase 6
Type:Chromatin regulator; hydrolase; repressor
Mol. Mass.:131381.51
Organism:Homo sapiens (Human)
Description:Q9UBN7
Residue:1215
BDBM50386453
NameBDBM50386453
Synonyms:CHEMBL2047540
TypeSmall organic molecule
Emp. Form.C11H13BrN2O3S
Mol. Mass.333.202
SMILESOc1ccc(CC(N=O)C(=O)NCCS)cc1Br