Reaction Details
TargetHistone deacetylase 6
LigandBDBM50386467
Substrate/Competitorn/a
Meas. Tech.ChEMBL_827135 (CHEMBL2050419)
IC50 1000±n/a nM
Citation Baud, MGLeiser, THaus, PSamlal, SWong, ACWood, RJPetrucci, VGunaratnam, MHughes, SMBuluwela, LTurlais, FNeidle, SMeyer-Almes, FJWhite, AJFuchter, MJ Defining the mechanism of action and enzymatic selectivity of psammaplin A against its epigenetic targets. J Med Chem55:1731-50 (2012) 
 
Histone deacetylase 6
Name:Histone deacetylase 6
Type:Chromatin regulator; hydrolase; repressor
Mol. Mass.:131381.51
Organism:Homo sapiens (Human)
Description:Q9UBN7
Residue:1215
BDBM50386467
NameBDBM50386467
Synonyms:CHEMBL2047675
TypeSmall organic molecule
Emp. Form.C11H12BrNO3S
Mol. Mass.318.187
SMILESOc1ccc(CC(=O)C(=O)NCCS)cc1Br