Reaction Details
TargetATP-binding cassette sub-family C member 5
LigandBDBM50386476
Substrate/Competitorn/a
Meas. Tech.ChEMBL_826118 (CHEMBL2049559)
Ki 75.3±n/a nM
Citation Sager, GØrvoll, EOLysaa, RAKufareva, IAbagyan, RRavna, AW Novel cGMP efflux inhibitors identified by virtual ligand screening (VLS) and confirmed by experimental studies. J Med Chem55:3049-57 (2012) 
 
ATP-binding cassette sub-family C member 5
Name:ATP-binding cassette sub-family C member 5
Type:PROTEIN
Mol. Mass.:160694.29
Organism:Homo sapiens (Human)
Description:ChEMBL_836094
Residue:1437
BDBM50386476
NameBDBM50386476
Synonyms:CHEMBL2047880
TypeSmall organic molecule
Emp. Form.C25H27N5O7S
Mol. Mass.541.576
SMILESCCOc1ccc(cc1-c1nc2c(nn(C)c2c(=O)[nH]1)C(C)(C)C)S(=O)(=O)Nc1ccc(O)c(c1)C(O)=O