Reaction Details
TargetATP-binding cassette sub-family C member 5
LigandBDBM54115
Substrate/Competitorn/a
Meas. Tech.ChEMBL_826118 (CHEMBL2049559)
Ki 65.3±n/a nM
Citation Sager, GØrvoll, EOLysaa, RAKufareva, IAbagyan, RRavna, AW Novel cGMP efflux inhibitors identified by virtual ligand screening (VLS) and confirmed by experimental studies. J Med Chem55:3049-57 (2012) 
 
ATP-binding cassette sub-family C member 5
Name:ATP-binding cassette sub-family C member 5
Type:PROTEIN
Mol. Mass.:160694.29
Organism:Homo sapiens (Human)
Description:ChEMBL_836094
Residue:1437
BDBM54115
NameBDBM54115
Synonyms:5-[4-Ethoxy-3-(1-methyl-7-oxo-3-propyl-6,7-dihydro-1H-pyrazolo[4,3-d]pyrimidin-5-yl)-benzenesulfonyla mino]-2-hydroxy-benzoic acid 5-[[4-ethoxy-3-(1-methyl-7-oxo-3-propyl-4H-pyrazolo[4,3-d]pyrimidin-5-yl)phenyl]sulfonylamino]-2-hydroxybenzoic acid CHEMBL1338248 SMR000413792 | cid_1899750
TypeSmall organic molecule
Emp. Form.C24H25N5O7S
Mol. Mass.527.55
SMILESCCCc1nn(C)c2c1nc([nH]c2=O)-c1cc(ccc1OCC)S(=O)(=O)Nc1ccc(O)c(c1)C(O)=O