Reaction Details
TargetBeta-secretase 1
LigandBDBM50386482
Substrate/Competitorn/a
Meas. Tech.ChEMBL_826120 (CHEMBL2049561)
IC50 2±n/a nM
Citation Rueeger, HLueoend, RRogel, ORondeau, JMMöbitz, HMachauer, RJacobson, LStaufenbiel, MDesrayaud, SNeumann, U Discovery of cyclic sulfone hydroxyethylamines as potent and selectiveß-site APP-cleaving enzyme 1 (BACE1) inhibitors: structure-based design and in vivo reduction of amyloidß-peptides. J Med Chem55:3364-86 (2012) 
 
Beta-secretase 1
Name:Beta-secretase 1
Type:Protein
Mol. Mass.:55755.10
Organism:Homo sapiens (Human)
Description:P56817
Residue:501
BDBM50386482
NameBDBM50386482
Synonyms:CHEMBL2048059
TypeSmall organic molecule
Emp. Form.C26H31F7N2O5S
Mol. Mass.616.589
SMILESCC(C)(CO)c1cccc(CN[C@H]2CS(=O)(=O)C[C@@H](Cc3cc(F)c(N)c(OC(C(F)(F)F)C(F)(F)F)c3)[C@@H]2O)c1