Reaction Details
TargetAmine oxidase [flavin-containing] B
LigandBDBM50386544
Substrate/Competitorn/a
Meas. Tech.ChEMBL_826183 (CHEMBL2049624)
Ki 1584.89±n/a nM
Citation Pettersson, FSvensson, PWaters, SWaters, NSonesson, C Synthesis and evaluation of a set of para-substituted 4-phenylpiperidines and 4-phenylpiperazines as monoamine oxidase (MAO) inhibitors. J Med Chem55:3242-9 (2012) 
 
Amine oxidase [flavin-containing] B
Name:Amine oxidase [flavin-containing] B
Type:Enzyme
Mol. Mass.:58469.65
Organism:Rattus norvegicus (rat)
Description:P19643
Residue:520
BDBM50386544
NameBDBM50386544
Synonyms:CHEMBL2048231
TypeSmall organic molecule
Emp. Form.C18H29NO
Mol. Mass.275.429
SMILESCCCCOc1ccc(cc1)C1CCN(CCC)CC1