Reaction Details
TargetFarnesyl pyrophosphate synthase
LigandBDBM25270
Substrate/Competitorn/a
Meas. Tech.ChEMBL_826197 (CHEMBL2049638)
IC50>10000±n/a nM
Citation Lin, YSPark, JDe Schutter, JWHuang, XFBerghuis, AMSebag, MTsantrizos, YS Design and synthesis of active site inhibitors of the human farnesyl pyrophosphate synthase: apoptosis and inhibition of ERK phosphorylation in multiple myeloma cells. J Med Chem55:3201-15 (2012) 
 
Farnesyl pyrophosphate synthase
Name:Farnesyl pyrophosphate synthase
Type:Enzyme
Mol. Mass.:48272.89
Organism:Homo sapiens (Human)
Description:P14324
Residue:419
BDBM25270
NameBDBM25270
Synonyms:[(6E,11E)-2,6,12,16-tetramethyl-9-phosphonoheptadeca-2,6,11,15-tetraen-9-yl]phosphonic acid | bisphosphonate, 5
TypeSmall organic molecule
Emp. Form.C21H38O6P2
Mol. Mass.448.4703
SMILES[#6]\[#6](-[#6])=[#6]\[#6]-[#6]\[#6](-[#6])=[#6]\[#6]C([#6]\[#6]=[#6](/[#6])-[#6]-[#6]\[#6]=[#6](\[#6])-[#6])(P([#8])([#8])=O)P([#8])([#8])=O