Reaction Details
TargetFarnesyl pyrophosphate synthase
LigandBDBM50386551
Substrate/Competitorn/a
Meas. Tech.ChEMBL_826197 (CHEMBL2049638)
IC50 164±n/a nM
Citation Lin, YSPark, JDe Schutter, JWHuang, XFBerghuis, AMSebag, MTsantrizos, YS Design and synthesis of active site inhibitors of the human farnesyl pyrophosphate synthase: apoptosis and inhibition of ERK phosphorylation in multiple myeloma cells. J Med Chem55:3201-15 (2012) 
 
Farnesyl pyrophosphate synthase
Name:Farnesyl pyrophosphate synthase
Type:Enzyme
Mol. Mass.:48272.89
Organism:Homo sapiens (Human)
Description:P14324
Residue:419
BDBM50386551
NameBDBM50386551
Synonyms:CHEMBL2048237
TypeSmall organic molecule
Emp. Form.C13H15NO6P2
Mol. Mass.343.2088
SMILESOP(O)(=O)C(Cc1cncc(c1)-c1ccccc1)P(O)(O)=O