Reaction Details
TargetFarnesyl pyrophosphate synthase
LigandBDBM50386552
Substrate/Competitorn/a
Meas. Tech.ChEMBL_826197 (CHEMBL2049638)
IC50 47±n/a nM
Citation Lin, YSPark, JDe Schutter, JWHuang, XFBerghuis, AMSebag, MTsantrizos, YS Design and synthesis of active site inhibitors of the human farnesyl pyrophosphate synthase: apoptosis and inhibition of ERK phosphorylation in multiple myeloma cells. J Med Chem55:3201-15 (2012) 
 
Farnesyl pyrophosphate synthase
Name:Farnesyl pyrophosphate synthase
Type:Enzyme
Mol. Mass.:48272.89
Organism:Homo sapiens (Human)
Description:P14324
Residue:419
BDBM50386552
NameBDBM50386552
Synonyms:CHEMBL2048238
TypeSmall organic molecule
Emp. Form.C12H14N2O6P2
Mol. Mass.344.1969
SMILESOP(O)(=O)C(Nc1cncc(c1)-c1ccccc1)P(O)(O)=O