Reaction Details
TargetFarnesyl pyrophosphate synthase
LigandBDBM50386554
Substrate/Competitorn/a
Meas. Tech.ChEMBL_826197 (CHEMBL2049638)
IC50 430±n/a nM
Citation Lin, YSPark, JDe Schutter, JWHuang, XFBerghuis, AMSebag, MTsantrizos, YS Design and synthesis of active site inhibitors of the human farnesyl pyrophosphate synthase: apoptosis and inhibition of ERK phosphorylation in multiple myeloma cells. J Med Chem55:3201-15 (2012) 
 
Farnesyl pyrophosphate synthase
Name:Farnesyl pyrophosphate synthase
Type:Enzyme
Mol. Mass.:48272.89
Organism:Homo sapiens (Human)
Description:P14324
Residue:419
BDBM50386554
NameBDBM50386554
Synonyms:CHEMBL2048240
TypeSmall organic molecule
Emp. Form.C13H14N4O6P2
Mol. Mass.384.221
SMILESOP(O)(=O)C(Nc1cc(ccn1)-c1ccc2[nH]ncc2c1)P(O)(O)=O