Reaction Details
TargetP2X purinoceptor 7
LigandBDBM50386566
Substrate/Competitorn/a
Meas. Tech.ChEMBL_826224 (CHEMBL2049235)
IC50 13±n/a nM
Citation Lee, WGLee, SDCho, JHJung, YKim, JHHien, TTKang, KWKo, HKim, YC Structure-activity relationships and optimization of 3,5-dichloropyridine derivatives as novel P2X(7) receptor antagonists. J Med Chem55:3687-98 (2012) 
 
P2X purinoceptor 7
Name:P2X purinoceptor 7
Type:Protein
Mol. Mass.:68602.85
Organism:Homo sapiens (Human)
Description:Q99572
Residue:595
BDBM50386566
NameBDBM50386566
Synonyms:CHEMBL2048438
TypeSmall organic molecule
Emp. Form.C18H23Cl2N3O
Mol. Mass.368.301
SMILESCC12CC3CC(C)(C1)CC(C3)(C2)C(=O)NNc1c(Cl)cncc1Cl