Reaction Details
TargetP2X purinoceptor 7
LigandBDBM50386568
Substrate/Competitorn/a
Meas. Tech.ChEMBL_826226 (CHEMBL2049237)
IC50 130±n/a nM
Citation Lee, WGLee, SDCho, JHJung, YKim, JHHien, TTKang, KWKo, HKim, YC Structure-activity relationships and optimization of 3,5-dichloropyridine derivatives as novel P2X(7) receptor antagonists. J Med Chem55:3687-98 (2012) 
 
P2X purinoceptor 7
Name:P2X purinoceptor 7
Type:Protein
Mol. Mass.:68602.85
Organism:Homo sapiens (Human)
Description:Q99572
Residue:595
BDBM50386568
NameBDBM50386568
Synonyms:CHEMBL2048436
TypeSmall organic molecule
Emp. Form.C16H19Cl2N3O
Mol. Mass.340.248
SMILESClc1cncc(Cl)c1NNC(=O)C1C2CC3CC(C2)CC1C3