Reaction Details
TargetCarbonic anhydrase 2
LigandBDBM50098106
Substrate/Competitorn/a
Meas. Tech.ChEMBL_826238 (CHEMBL2049249)
Ki 1.3±n/a nM
Citation Hewitson, KSVullo, DScozzafava, AMastrolorenzo, ASupuran, CT Molecular cloning, characterization, and inhibition studies of aß-carbonic anhydrase from Malassezia globosa, a potential antidandruff target. J Med Chem55:3513-20 (2012) 
 
Carbonic anhydrase 2
Name:Carbonic anhydrase 2
Type:Enzyme
Mol. Mass.:29250.71
Organism:Homo sapiens (Human)
Description:P00918
Residue:260
BDBM50098106
NameBDBM50098106
Synonyms:CHEMBL24259 Sulfamic acid phenyl ester | phenyl sulfamate
TypeSmall organic molecule
Emp. Form.C6H7NO3S
Mol. Mass.173.19
SMILESNS(=O)(=O)Oc1ccccc1