Reaction Details
TargetFree fatty acid receptor 1
LigandBDBM50386652
Substrate/Competitorn/a
Meas. Tech.ChEMBL_826835 (CHEMBL2051552)
Ki 58±n/a nM
Citation Mikami, SKitamura, SNegoro, NSasaki, SSuzuki, MTsujihata, YMiyazaki, TIto, RSuzuki, NMiyazaki, JSantou, TKanzaki, NFunami, MTanaka, TYasuma, TMomose, Y Discovery of phenylpropanoic acid derivatives containing polar functionalities as potent and orally bioavailable G protein-coupled receptor 40 agonists for the treatment of type 2 diabetes. J Med Chem55:3756-76 (2012) 
 
Free fatty acid receptor 1
Name:Free fatty acid receptor 1
Type:G Protein-Coupled Receptor (GPCR)
Mol. Mass.:31473.32
Organism:Homo sapiens (Human)
Description:O14842
Residue:300
BDBM50386652
NameBDBM50386652
Synonyms:CHEMBL2048610
TypeSmall organic molecule
Emp. Form.C25H26O3
Mol. Mass.374.4721
SMILESCc1cccc(C)c1-c1cccc(COc2ccc(CCC(O)=O)cc2)c1C