Reaction Details
TargetQuinolone resistance protein NorA
LigandBDBM50386656
Substrate/Competitorn/a
Meas. Tech.ChEMBL_826866 (CHEMBL2051681)
IC50 10000±n/a nM
Citation Sabatini, SGosetto, FSerritella, SManfroni, GTabarrini, OIraci, NBrincat, JPCarosati, EVillarini, MKaatz, GWCecchetti, V Pyrazolo[4,3-c][1,2]benzothiazines 5,5-dioxide: a promising new class of Staphylococcus aureus NorA efflux pump inhibitors. J Med Chem55:3568-72 (2012) 
 
Quinolone resistance protein NorA
Name:Quinolone resistance protein NorA
Type:PROTEIN
Mol. Mass.:42273.03
Organism:Staphylococcus aureus
Description:ChEMBL_961221
Residue:388
BDBM50386656
NameBDBM50386656
Synonyms:CHEMBL2048632
TypeSmall organic molecule
Emp. Form.C21H13ClN4O4S
Mol. Mass.452.87
SMILES[O-][N+](=O)c1ccc(cc1)-n1nc(c2NS(=O)(=O)c3ccccc3-c12)-c1ccc(Cl)cc1