Reaction Details
TargetHistone deacetylase 2
LigandBDBM50386662
Substrate/Competitorn/a
Meas. Tech.ChEMBL_826885 (CHEMBL2051700)
IC50 381.1±n/a nM
Citation Lai, MJHuang, HLPan, SLLiu, YMPeng, CYLee, HYYeh, TKHuang, PHTeng, CMChen, CSChuang, HYLiou, JP Synthesis and biological evaluation of 1-arylsulfonyl-5-(N-hydroxyacrylamide)indoles as potent histone deacetylase inhibitors with antitumor activity in vivo. J Med Chem55:3777-91 (2012) 
 
Histone deacetylase 2
Name:Histone deacetylase 2
Type:Chromatin regulator; hydrolase; repressor
Mol. Mass.:55356.54
Organism:Homo sapiens (Human)
Description:Q92769
Residue:488
BDBM50386662
NameBDBM50386662
Synonyms:CHEMBL2048755
TypeSmall organic molecule
Emp. Form.C18H16N2O2
Mol. Mass.292.3318
SMILESONC(=O)\C=C\c1ccc2n(Cc3ccccc3)ccc2c1