Reaction Details
TargetHistone deacetylase 6
LigandBDBM50386660
Substrate/Competitorn/a
Meas. Tech.ChEMBL_826886 (CHEMBL2051701)
IC50 59.2±n/a nM
Citation Lai, MJHuang, HLPan, SLLiu, YMPeng, CYLee, HYYeh, TKHuang, PHTeng, CMChen, CSChuang, HYLiou, JP Synthesis and biological evaluation of 1-arylsulfonyl-5-(N-hydroxyacrylamide)indoles as potent histone deacetylase inhibitors with antitumor activity in vivo. J Med Chem55:3777-91 (2012) 
 
Histone deacetylase 6
Name:Histone deacetylase 6
Type:Chromatin regulator; hydrolase; repressor
Mol. Mass.:131381.51
Organism:Homo sapiens (Human)
Description:Q9UBN7
Residue:1215
BDBM50386660
NameBDBM50386660
Synonyms:CHEMBL2048751
TypeSmall organic molecule
Emp. Form.C17H13FN2O4S
Mol. Mass.360.36
SMILESONC(=O)\C=C\c1ccc2n(ccc2c1)S(=O)(=O)c1ccc(F)cc1