Reaction Details
TargetMu-type opioid receptor
LigandBDBM50386683
Substrate/Competitorn/a
Meas. Tech.ChEMBL_827244 (CHEMBL2050643)
IC50 150±n/a nM
Citation Neumeyer, JLZhang, BZhang, TSromek, AWKnapp, BICohen, DJBidlack, JM Synthesis, binding affinity, and functional in vitro activity of 3-benzylaminomorphinan and 3-benzylaminomorphine ligands at opioid receptors. J Med Chem55:3878-90 (2012) 
 
Mu-type opioid receptor
Name:Mu-type opioid receptor
Type:G Protein-Coupled Receptor (GPCR)
Mol. Mass.:44789.51
Organism:Homo sapiens (Human)
Description:P35372
Residue:400
BDBM50386683
NameBDBM50386683
Synonyms:CHEMBL2048762
TypeSmall organic molecule
Emp. Form.C29H38N2O
Mol. Mass.430.6248
SMILESCOc1ccc(CNc2ccc3C[C@@H]4[C@@H]5CCCC[C@]5(CCN4CC4CCC4)c3c2)cc1