Reaction Details
TargetDelta-type opioid receptor
LigandBDBM50138010
Substrate/Competitorn/a
Meas. Tech.ChEMBL_827236 (CHEMBL2050635)
Ki 1500±n/a nM
Citation Neumeyer, JLZhang, BZhang, TSromek, AWKnapp, BICohen, DJBidlack, JM Synthesis, binding affinity, and functional in vitro activity of 3-benzylaminomorphinan and 3-benzylaminomorphine ligands at opioid receptors. J Med Chem55:3878-90 (2012) 
 
Delta-type opioid receptor
Name:Delta-type opioid receptor
Type:G Protein-Coupled Receptor (GPCR)
Mol. Mass.:40382.98
Organism:Homo sapiens (Human)
Description:Competition binding assays were carried out using membrane preparations from transfected HN9.10 cells that constitutively expressed the delta opioid receptor.
Residue:372
BDBM50138010
NameBDBM50138010
Synonyms:3-Amino-N-methylmorphinan US10766864, Example 114
TypeSmall organic molecule
Emp. Form.C17H24N2
Mol. Mass.256.3859
SMILESCN1CC[C@]23CCCC[C@H]2[C@H]1Cc1ccc(N)cc31