Reaction Details
TargetKappa-type opioid receptor
LigandBDBM50386676
Substrate/Competitorn/a
Meas. Tech.ChEMBL_827246 (CHEMBL2050645)
EC50 47±n/a nM
Citation Neumeyer, JLZhang, BZhang, TSromek, AWKnapp, BICohen, DJBidlack, JM Synthesis, binding affinity, and functional in vitro activity of 3-benzylaminomorphinan and 3-benzylaminomorphine ligands at opioid receptors. J Med Chem55:3878-90 (2012) 
 
Kappa-type opioid receptor
Name:Kappa-type opioid receptor
Type:G Protein-Coupled Receptor (GPCR)
Mol. Mass.:42648.76
Organism:Homo sapiens (Human)
Description:P41145
Residue:380
BDBM50386676
NameBDBM50386676
Synonyms:CHEMBL2048768
TypeSmall organic molecule
Emp. Form.C28H36N2O
Mol. Mass.416.5982
SMILESOc1ccccc1CNc1ccc2C[C@@H]3[C@@H]4CCCC[C@]4(CCN3CC3CCC3)c2c1