Reaction Details
TargetMu-type opioid receptor
LigandBDBM50303625
Substrate/Competitorn/a
Meas. Tech.ChEMBL_827242 (CHEMBL2050641)
EC50 6.8±n/a nM
Citation Neumeyer, JLZhang, BZhang, TSromek, AWKnapp, BICohen, DJBidlack, JM Synthesis, binding affinity, and functional in vitro activity of 3-benzylaminomorphinan and 3-benzylaminomorphine ligands at opioid receptors. J Med Chem55:3878-90 (2012) 
 
Mu-type opioid receptor
Name:Mu-type opioid receptor
Type:G Protein-Coupled Receptor (GPCR)
Mol. Mass.:44789.51
Organism:Homo sapiens (Human)
Description:P35372
Residue:400
BDBM50303625
NameBDBM50303625
Synonyms:17-(Cyclopropylmethyl)-N-(4-methoxybenzyl)morphinan-3-amine | CHEMBL568877
TypeSmall organic molecule
Emp. Form.C28H36N2O
Mol. Mass.416.5982
SMILESCOc1ccc(CNc2ccc3C[C@@H]4[C@@H]5CCCC[C@]5(CCN4CC4CC4)c3c2)cc1