Reaction Details
TargetKappa-type opioid receptor
LigandBDBM50386681
Substrate/Competitorn/a
Meas. Tech.ChEMBL_827234 (CHEMBL2050633)
Ki 1.1±n/a nM
Citation Neumeyer, JLZhang, BZhang, TSromek, AWKnapp, BICohen, DJBidlack, JM Synthesis, binding affinity, and functional in vitro activity of 3-benzylaminomorphinan and 3-benzylaminomorphine ligands at opioid receptors. J Med Chem55:3878-90 (2012) 
 
Kappa-type opioid receptor
Name:Kappa-type opioid receptor
Type:G Protein-Coupled Receptor (GPCR)
Mol. Mass.:42648.76
Organism:Homo sapiens (Human)
Description:P41145
Residue:380
BDBM50386681
NameBDBM50386681
Synonyms:CHEMBL2048764
TypeSmall organic molecule
Emp. Form.C29H36N2O2
Mol. Mass.444.6083
SMILESC(Nc1ccc2C[C@@H]3[C@@H]4CCCC[C@]4(CCN3CC3CCC3)c2c1)c1ccc2OCOc2c1