Reaction Details
TargetDelta-type opioid receptor
LigandBDBM50386664
Substrate/Competitorn/a
Meas. Tech.ChEMBL_827236 (CHEMBL2050635)
Ki 41±n/a nM
Citation Neumeyer, JLZhang, BZhang, TSromek, AWKnapp, BICohen, DJBidlack, JM Synthesis, binding affinity, and functional in vitro activity of 3-benzylaminomorphinan and 3-benzylaminomorphine ligands at opioid receptors. J Med Chem55:3878-90 (2012) 
 
Delta-type opioid receptor
Name:Delta-type opioid receptor
Type:G Protein-Coupled Receptor (GPCR)
Mol. Mass.:40382.98
Organism:Homo sapiens (Human)
Description:Competition binding assays were carried out using membrane preparations from transfected HN9.10 cells that constitutively expressed the delta opioid receptor.
Residue:372
BDBM50386664
NameBDBM50386664
Synonyms:CHEMBL2048772
TypeSmall organic molecule
Emp. Form.C27H34N2O
Mol. Mass.402.5717
SMILESOc1cccc(CNc2ccc3C[C@@H]4[C@@H]5CCCC[C@]5(CCN4CC4CC4)c3c2)c1