Reaction Details
TargetDelta-type opioid receptor
LigandBDBM50017233
Substrate/Competitorn/a
Meas. Tech.ChEMBL_827236 (CHEMBL2050635)
Ki 4.2±n/a nM
Citation Neumeyer, JLZhang, BZhang, TSromek, AWKnapp, BICohen, DJBidlack, JM Synthesis, binding affinity, and functional in vitro activity of 3-benzylaminomorphinan and 3-benzylaminomorphine ligands at opioid receptors. J Med Chem55:3878-90 (2012) 
 
Delta-type opioid receptor
Name:Delta-type opioid receptor
Type:G Protein-Coupled Receptor (GPCR)
Mol. Mass.:40382.98
Organism:Homo sapiens (Human)
Description:Competition binding assays were carried out using membrane preparations from transfected HN9.10 cells that constitutively expressed the delta opioid receptor.
Residue:372
BDBM50017233
NameBDBM50017233
Synonyms:CHEMBL592 LEVORPHANOL
TypeSmall organic molecule
Emp. Form.C17H23NO
Mol. Mass.257.3706
SMILESCN1CC[C@]23CCCC[C@H]2[C@H]1Cc1ccc(O)cc31