Reaction Details
TargetMu-type opioid receptor
LigandBDBM50386678
Substrate/Competitorn/a
Meas. Tech.ChEMBL_827233 (CHEMBL2050632)
Ki 0.170000±n/a nM
Citation Neumeyer, JLZhang, BZhang, TSromek, AWKnapp, BICohen, DJBidlack, JM Synthesis, binding affinity, and functional in vitro activity of 3-benzylaminomorphinan and 3-benzylaminomorphine ligands at opioid receptors. J Med Chem55:3878-90 (2012) 
 
Mu-type opioid receptor
Name:Mu-type opioid receptor
Type:G Protein-Coupled Receptor (GPCR)
Mol. Mass.:44789.51
Organism:Homo sapiens (Human)
Description:P35372
Residue:400
BDBM50386678
NameBDBM50386678
Synonyms:CHEMBL2048766
TypeSmall organic molecule
Emp. Form.C28H34N2O2
Mol. Mass.430.5818
SMILESC(Nc1ccc2C[C@@H]3[C@@H]4CCCC[C@]4(CCN3CC3CC3)c2c1)c1ccc2OCOc2c1