Reaction Details
TargetKappa-type opioid receptor
LigandBDBM50386690
Substrate/Competitorn/a
Meas. Tech.ChEMBL_827234 (CHEMBL2050633)
Ki 0.990000±n/a nM
Citation Neumeyer, JLZhang, BZhang, TSromek, AWKnapp, BICohen, DJBidlack, JM Synthesis, binding affinity, and functional in vitro activity of 3-benzylaminomorphinan and 3-benzylaminomorphine ligands at opioid receptors. J Med Chem55:3878-90 (2012) 
 
Kappa-type opioid receptor
Name:Kappa-type opioid receptor
Type:G Protein-Coupled Receptor (GPCR)
Mol. Mass.:42648.76
Organism:Homo sapiens (Human)
Description:P41145
Residue:380
BDBM50386690
NameBDBM50386690
Synonyms:CHEMBL2048781
TypeSmall organic molecule
Emp. Form.C27H34N2O
Mol. Mass.402.5717
SMILESOc1cccc(CNc2ccc3c(C[C@@H]4[C@@H]5CCCC[C@]35CCN4CC3CC3)c2)c1