Reaction Details
TargetMu-type opioid receptor
LigandBDBM50386673
Substrate/Competitorn/a
Meas. Tech.ChEMBL_827244 (CHEMBL2050643)
IC50 7.6±n/a nM
Citation Neumeyer, JLZhang, BZhang, TSromek, AWKnapp, BICohen, DJBidlack, JM Synthesis, binding affinity, and functional in vitro activity of 3-benzylaminomorphinan and 3-benzylaminomorphine ligands at opioid receptors. J Med Chem55:3878-90 (2012) 
 
Mu-type opioid receptor
Name:Mu-type opioid receptor
Type:G Protein-Coupled Receptor (GPCR)
Mol. Mass.:44789.51
Organism:Homo sapiens (Human)
Description:P35372
Residue:400
BDBM50386673
NameBDBM50386673
Synonyms:CHEMBL2048773
TypeSmall organic molecule
Emp. Form.C27H34N2O
Mol. Mass.402.5717
SMILESOc1ccc(CNc2ccc3C[C@@H]4[C@@H]5CCCC[C@]5(CCN4CC4CC4)c3c2)cc1