Reaction Details
TargetMu-type opioid receptor
LigandBDBM50386676
Substrate/Competitorn/a
Meas. Tech.ChEMBL_827244 (CHEMBL2050643)
IC50 810±n/a nM
Citation Neumeyer, JLZhang, BZhang, TSromek, AWKnapp, BICohen, DJBidlack, JM Synthesis, binding affinity, and functional in vitro activity of 3-benzylaminomorphinan and 3-benzylaminomorphine ligands at opioid receptors. J Med Chem55:3878-90 (2012) 
 
Mu-type opioid receptor
Name:Mu-type opioid receptor
Type:G Protein-Coupled Receptor (GPCR)
Mol. Mass.:44789.51
Organism:Homo sapiens (Human)
Description:P35372
Residue:400
BDBM50386676
NameBDBM50386676
Synonyms:CHEMBL2048768
TypeSmall organic molecule
Emp. Form.C28H36N2O
Mol. Mass.416.5982
SMILESOc1ccccc1CNc1ccc2C[C@@H]3[C@@H]4CCCC[C@]4(CCN3CC3CCC3)c2c1