Reaction Details
TargetMu-type opioid receptor
LigandBDBM50386672
Substrate/Competitorn/a
Meas. Tech.ChEMBL_827242 (CHEMBL2050641)
EC50 6.5±n/a nM
Citation Neumeyer, JLZhang, BZhang, TSromek, AWKnapp, BICohen, DJBidlack, JM Synthesis, binding affinity, and functional in vitro activity of 3-benzylaminomorphinan and 3-benzylaminomorphine ligands at opioid receptors. J Med Chem55:3878-90 (2012) 
 
Mu-type opioid receptor
Name:Mu-type opioid receptor
Type:G Protein-Coupled Receptor (GPCR)
Mol. Mass.:44789.51
Organism:Homo sapiens (Human)
Description:P35372
Residue:400
BDBM50386672
NameBDBM50386672
Synonyms:CHEMBL2048774
TypeSmall organic molecule
Emp. Form.C24H30N2O
Mol. Mass.362.5078
SMILESCN1CC[C@]23CCCC[C@H]2[C@H]1Cc1ccc(NCc2cccc(O)c2)cc31