Reaction Details
TargetKappa-type opioid receptor
LigandBDBM50138010
Substrate/Competitorn/a
Meas. Tech.ChEMBL_827234 (CHEMBL2050633)
Ki 110±n/a nM
Citation Neumeyer, JLZhang, BZhang, TSromek, AWKnapp, BICohen, DJBidlack, JM Synthesis, binding affinity, and functional in vitro activity of 3-benzylaminomorphinan and 3-benzylaminomorphine ligands at opioid receptors. J Med Chem55:3878-90 (2012) 
 
Kappa-type opioid receptor
Name:Kappa-type opioid receptor
Type:G Protein-Coupled Receptor (GPCR)
Mol. Mass.:42648.76
Organism:Homo sapiens (Human)
Description:P41145
Residue:380
BDBM50138010
NameBDBM50138010
Synonyms:3-Amino-N-methylmorphinan US10766864, Example 114
TypeSmall organic molecule
Emp. Form.C17H24N2
Mol. Mass.256.3859
SMILESCN1CC[C@]23CCCC[C@H]2[C@H]1Cc1ccc(N)cc31