Reaction Details
TargetKappa-type opioid receptor
LigandBDBM50017233
Substrate/Competitorn/a
Meas. Tech.ChEMBL_827234 (CHEMBL2050633)
Ki 2.3±n/a nM
Citation Neumeyer, JLZhang, BZhang, TSromek, AWKnapp, BICohen, DJBidlack, JM Synthesis, binding affinity, and functional in vitro activity of 3-benzylaminomorphinan and 3-benzylaminomorphine ligands at opioid receptors. J Med Chem55:3878-90 (2012) 
 
Kappa-type opioid receptor
Name:Kappa-type opioid receptor
Type:G Protein-Coupled Receptor (GPCR)
Mol. Mass.:42648.76
Organism:Homo sapiens (Human)
Description:P41145
Residue:380
BDBM50017233
NameBDBM50017233
Synonyms:CHEMBL592 LEVORPHANOL
TypeSmall organic molecule
Emp. Form.C17H23NO
Mol. Mass.257.3706
SMILESCN1CC[C@]23CCCC[C@H]2[C@H]1Cc1ccc(O)cc31