Reaction Details
TargetMu-type opioid receptor
LigandBDBM50137997
Substrate/Competitorn/a
Meas. Tech.ChEMBL_827233 (CHEMBL2050632)
Ki 1.3±n/a nM
Citation Neumeyer, JLZhang, BZhang, TSromek, AWKnapp, BICohen, DJBidlack, JM Synthesis, binding affinity, and functional in vitro activity of 3-benzylaminomorphinan and 3-benzylaminomorphine ligands at opioid receptors. J Med Chem55:3878-90 (2012) 
 
Mu-type opioid receptor
Name:Mu-type opioid receptor
Type:G Protein-Coupled Receptor (GPCR)
Mol. Mass.:44789.51
Organism:Homo sapiens (Human)
Description:P35372
Residue:400
BDBM50137997
NameBDBM50137997
Synonyms:3-Amino-N-cyclopropylmethylmorphinan CHEMBL299220 | MCL-149
TypeSmall organic molecule
Emp. Form.C20H28N2
Mol. Mass.296.4497
SMILESNc1ccc2C[C@@H]3[C@@H]4CCCC[C@]4(CCN3CC3CC3)c2c1