Reaction Details
TargetKappa-type opioid receptor
LigandBDBM50303631
Substrate/Competitorn/a
Meas. Tech.ChEMBL_827234 (CHEMBL2050633)
Ki 2.8±n/a nM
Citation Neumeyer, JLZhang, BZhang, TSromek, AWKnapp, BICohen, DJBidlack, JM Synthesis, binding affinity, and functional in vitro activity of 3-benzylaminomorphinan and 3-benzylaminomorphine ligands at opioid receptors. J Med Chem55:3878-90 (2012) 
 
Kappa-type opioid receptor
Name:Kappa-type opioid receptor
Type:G Protein-Coupled Receptor (GPCR)
Mol. Mass.:42648.76
Organism:Homo sapiens (Human)
Description:P41145
Residue:380
BDBM50303631
NameBDBM50303631
Synonyms:CHEMBL571560 | N-Benzyl-17-(cyclobutylmethyl)morphinan-3-amine
TypeSmall organic molecule
Emp. Form.C28H36N2
Mol. Mass.400.5988
SMILESC(Nc1ccc2C[C@@H]3[C@@H]4CCCC[C@]4(CCN3CC3CCC3)c2c1)c1ccccc1