Reaction Details
TargetAurora kinase B
LigandBDBM50386693
Substrate/Competitorn/a
Meas. Tech.ChEMBL_826390 (CHEMBL2049401)
IC50>10000±n/a nM
Citation Kawakita, YBanno, HOhashi, TTamura, TYusa, TNakayama, AMiki, HIwata, HKamiguchi, HTanaka, THabuka, NSogabe, SOhta, YIshikawa, T Design and synthesis of pyrrolo[3,2-d]pyrimidine human epidermal growth factor receptor 2 (HER2)/epidermal growth factor receptor (EGFR) dual inhibitors: exploration of novel back-pocket binders. J Med Chem55:3975-91 (2012) 
 
Aurora kinase B
Name:Aurora kinase B
Type:Protein
Mol. Mass.:39327.72
Organism:Homo sapiens (Human)
Description:Q96GD4
Residue:344
BDBM50386693
NameBDBM50386693
Synonyms:CHEMBL2048912
TypeSmall organic molecule
Emp. Form.C25H24ClN7O2S
Mol. Mass.522.022
SMILESCC(C)(N)C(=O)NCCn1ccc2ncnc(Nc3ccc(Oc4cccc5sncc45)c(Cl)c3)c12